BDBM50466607 CHEMBL4293646
SMILES [I-].CC[N+](CC)(CC)CCCCCCOc1ccc(\C=C\c2ccccc2)cc1
InChI Key InChIKey=IXZCXFATJZXLRO-WUKNDPDISA-N
Data  2 KI  2 IC50
  Tab Delimited (TSV)   2D SDfile   Computed 3D by Vconf -m prep SDfile
Find this compound or compounds like it in BindingDB:
Activity Spreadsheet -- Enzyme Inhibition Constant Data from BindingDB
Found 1 hit for monomerid = 50466607
TargetNeuronal acetylcholine receptor; alpha9/alpha10(Homo sapiens (Human))
Universit£
Curated by ChEMBL
LigandPNGBDBM50466607(CHEMBL4293646)
Affinity DataIC50:  4.80nM. Assay description: Antagonist activity at human alpha9alpha10 nACHR expressed in xenopous laevis oocyte assessed as inhibition of ACh-induced channel current after 5 mi...
Ligand InfoPC cidPC sid
In DepthDetails ArticlePubMed